{"text_format":"1","workbook":"xlsx","n_sheets":7,"sheets":["Select Winches","Vessel Sheet Loads","Comparative Handle Loads","Price Analysis","Harken Winch Specs","Anderson Winch Specs","Lewmar Winch Specs"],"not_rendered":{"charts":0,"images":4,"macros":1,"external_links":0,"defined_names":31,"comments":0,"pivot_tables":0},"unopened":[],"bounds":{"document_bytes":16777216,"sheet_cells":100000,"rows_first":2000,"rows_last":500,"rows_between":2000,"halvings":0,"cell_chars":16384,"cell_head_chars":4096},"cells_cut":0,"cells_raw":0,"read":"whole","date_system":"1900"}

{"sheet":"Select Winches","index":0,"n_rows":26,"n_cols":13,"rows_kept":26,"cut":false,"hidden":false,"merged":[[5,11,5,12],[11,11,11,12],[17,11,17,12],[1,0,1,10],[0,0,0,10],[5,1,5,10],[11,1,11,10],[17,1,17,10],[2,1,2,2]]}
["COMPARISON OF SPECIFICATIONS"]
["Self-Tailing Winches"]
[null,"Calculated Power Ratios"]
[null,"Power Ratio = ( 2 * length of handle * gear ratio ) / diameter of drum"]
[null,"For manufacturer's power ratios see following Specs worksheets"]
[null,"Anderson (S/S)",null,null,null,null,null,null,null,null,null,"Mfg. Stated Power Ratio"]
["Function","Model","1st Power Ratio","2nd Power Ratio",null,"1st Gear Ratio","2nd Gear Ratio",null,"D","B","H","1st Power Ratio","2nd Power Ratio"]
["Primary","52ST",{"$f":"LenHandle*2*F8/$I8","v":16.256},53.339999999999996,null,{"$f":"VLOOKUP($B8,AndersonSpecs,4)","v":3.2},{"$f":"VLOOKUP($B8,AndersonSpecs,5)","v":10.5},null,{"$f":"VLOOKUP($B8,AndersonSpecs,10)","v":3.9370078740157481},{"$f":"VLOOKUP($B8,AndersonSpecs,11)","v":7.8740157480314963},{"$f":"VLOOKUP($B8,AndersonSpecs,12)","v":8.8582677165354333},{"$f":"VLOOKUP($B8,AndersonSpecs,7)","v":16.2},{"$f":"VLOOKUP($B8,AndersonSpecs,8)","v":52}]
["Secondary","40ST",8.689473684210526,40.10526315789474,null,{"$f":"VLOOKUP(B9,AndersonSpecs,4)","v":1.3},{"$f":"VLOOKUP(B9,AndersonSpecs,5)","v":6},null,{"$f":"VLOOKUP($B9,AndersonSpecs,10)","v":2.9921259842519685},{"$f":"VLOOKUP($B9,AndersonSpecs,11)","v":5.984251968503937},{"$f":"VLOOKUP($B9,AndersonSpecs,12)","v":6.771653543307087},{"$f":"VLOOKUP($B9,AndersonSpecs,7)","v":8.5},{"$f":"VLOOKUP($B9,AndersonSpecs,8)","v":39.5}]
["Trim","28ST",9.4342857142857142,26.851428571428571,null,{"$f":"VLOOKUP(B10,AndersonSpecs,4)","v":1.3},{"$f":"VLOOKUP(B10,AndersonSpecs,5)","v":3.7},null,{"$f":"VLOOKUP($B10,AndersonSpecs,10)","v":2.7559055118110236},{"$f":"VLOOKUP($B10,AndersonSpecs,11)","v":4.9212598425196852},{"$f":"VLOOKUP($B10,AndersonSpecs,12)","v":5.984251968503937},{"$f":"VLOOKUP($B10,AndersonSpecs,7)","v":9.5},{"$f":"VLOOKUP($B10,AndersonSpecs,8)","v":26.5}]
[]
[null,"Harken Chrome",null,null,null,null,null,null,null,null,null,"Mfg. Stated Power Ratio"]
["Model","Model","1st Power Ratio","2nd Power Ratio","3rd Power Ratio","1st Gear Ratio","2nd Gear Ratio","3rd Gear Ratio*","D","B","H","1st Power Ratio","2nd Power Ratio"]
["Primary","B56.3STC",{"$f":"LenHandle*2*F14/$I14","v":21.05263157894737},54.736842105263158,9.2631578947368425,{"$f":"VLOOKUP($B14,HarkenSpecs,4)","v":5},{"$f":"VLOOKUP($B14,HarkenSpecs,5)","v":13},{"$f":"VLOOKUP($B14,HarkenSpecs,6)","v":2.2000000000000002},{"$f":"VLOOKUP($B14,HarkenSpecs,10)","v":4.75},{"$f":"VLOOKUP($B14,HarkenSpecs,11)","v":8.875},{"$f":"VLOOKUP($B14,HarkenSpecs,12)","v":10.625},{"$f":"VLOOKUP($B14,HarkenSpecs,7)","v":21},{"$f":"VLOOKUP($B14,HarkenSpecs,8)","v":56}]
["Secondary","B40.2STC",14.666666666666666,40,{"$error":"#N/A"},{"$f":"VLOOKUP(B15,HarkenSpecs,4)","v":2.2000000000000002},{"$f":"VLOOKUP(B15,HarkenSpecs,5)","v":6},{"$f":"VLOOKUP($B15,HarkenSpecs,6)","v":{"$error":"#N/A"}},{"$f":"VLOOKUP($B15,HarkenSpecs,10)","v":3},{"$f":"VLOOKUP($B15,HarkenSpecs,11)","v":5.875},{"$f":"VLOOKUP($B15,HarkenSpecs,12)","v":6.9375},{"$f":"VLOOKUP($B15,HarkenSpecs,7)","v":13.5},{"$f":"VLOOKUP($B15,HarkenSpecs,8)","v":40}]
{"$rows_left_out":12}
{"sheet":"Vessel Sheet Loads","index":1,"n_rows":33,"n_cols":17,"rows_kept":33,"cut":false,"hidden":false,"merged":[[31,2,31,4],[31,5,31,7],[31,8,31,10],[31,11,31,13],[0,0,0,13],[18,0,19,0],[18,2,18,13],[18,1,19,1],[28,0,28,13],[29,0,30,0],[29,1,30,1],[29,2,29,13],[26,0,26,7],[24,0,24,7],[1,0,2,0],[1,2,1,13],[8,0,8,7],[9,0,9,7],[25,0,25,7],[17,0,17,13]]}
["Calculated Genoa Sheet Loadings",null,null,null,null,null,null,null,null,null,null,null,null,null,"HIDDEN","HIDDEN","HIDDEN"]
["Sail","Area",{"$f":"C19","v":"Load (lbs.) for Apparent Wind (Knots)"},null,null,null,null,null,null,null,null,null,null,null,true,true,{"$f":"IF(P2,Q4,1)","v":0.2}]
[null,"Square Feet",5,{"$f":"C3+5","v":10},{"$f":"D3+5","v":15},{"$f":"E3+5","v":20},{"$f":"F3+5","v":25},{"$f":"G3+5","v":30},35,40,45,50,55,60,{"$f":"IF(NOT(UseFPS),1/2.2,1)","v":1}]
["Furling Genoa",479.6,{"$f":"KgPerLb*$B4*C$3*C$3*0.00431","v":51.676899999999996},206.70759999999999,465.09209999999996,826.83039999999994,1291.9224999999999,1860.3683999999998,2532.1680999999999,3307.3215999999998,4185.8288999999995,5167.6899999999996,6252.9048999999995,7441.4735999999994,null,null,{"$f":"VLOOKUP(B16,TravellerBlock,2)","v":0.2}]
["Genoa Part Furled (100%)",385,41.483749999999993,165.93499999999997,373.35374999999999,663.7399999999999,1037.09375,1493.415,2032.7037499999999,2654.9599999999996,3360.1837499999997,4148.375,5019.5337499999996,5973.66,null,"1:1",{"$f":"1/LEFT(P5)","v":1}]
["Working Staysail",160,17.239999999999998,68.959999999999994,155.16,275.83999999999997,430.99999999999994,620.64,844.75999999999988,1103.3599999999999,1396.4399999999998,1723.9999999999998,2086.04,2482.56,null,"2:1",{"$f":"1/LEFT(P6)","v":0.5}]
["Storm Staysail",115,12.391249999999999,49.564999999999998,111.52124999999999,198.26,309.78124999999994,446.08499999999998,607.17124999999999,793.04,1003.6912499999999,1239.1249999999998,1499.3412499999999,1784.34,null,"3:1",0.33333333333333331]
["Asym. Cr. Spinnaker",1295,139.53625,558.14499999999998,1255.8262499999998,2232.58,3488.4062499999995,5023.3049999999994,6837.276249999999,8930.32,11302.436249999999,13953.624999999998,16883.88625,20093.219999999998,null,"4:1",0.25]
["Genoa Sheet Load (lbs.) = SA * V**2 * 0.00431 ",null,null,null,null,null,null,null,null,null,null,null,null,null,null,"5:1",0.2]
["Formula Source: Harken (http://www.harken.com/content.aspx?id=9096)",null,null,null,null,null,null,null,null,null,null,null,null,null,null,"6:1",0.16666666666666666]
[null,null,null,null,null,null,null,null,null,null,null,null,null,null,null,"7:1",0.14285714285714285]
["Mainsail Dimensions",{"$f":"B21","v":1},{"$f":"B22","v":0.75},{"$f":"B23","v":0.50127226463104324},{"$f":"B24","v":0.27989821882951654},null,null,null,null,null,null,null,null,null,null,"8:1",0.125]
["P. Foot length of Main in feet",45.33,{"$f":"SQRT($B$22)*P","v":39.256931553548597},{"$f":"SQRT($B$23)*P","v":32.093904572161719},{"$f":"SQRT($B$24)*P","v":23.982021414906587}]
["E. Luff Length of Main in feet",14.6,{"$f":"SQRT($B$22)*E","v":12.643970895252803},{"$f":"SQRT($B$23)*E","v":10.336885214064882},{"$f":"SQRT($B$24)*E","v":7.7241895578565227}]
["X. Distance from Aft end of boom to mainsheet attachment point in feet",0,{"$f":"X-(E-E_2)","v":-1.9560291047471967},{"$f":"X-(E-E_3)","v":-4.2631147859351177},{"$f":"X-(E-E_4)","v":-6.8758104421434769}]
{"$rows_left_out":19}
{"sheet":"Comparative Handle Loads","index":2,"n_rows":76,"n_cols":15,"rows_kept":76,"cut":false,"hidden":false,"merged":[[0,0,0,14],[19,3,19,14],[39,0,40,0],[39,3,39,14],[10,0,11,0],[10,3,10,14],[28,0,29,0],[39,1,40,1],[28,1,29,1],[8,0,8,14],[1,0,1,12],[71,0,72,0],[71,1,72,1],[49,3,49,14],[49,0,50,0],[59,1,60,1],[49,1,50,1],[71,3,71,14],[69,0,69,14],[28,3,28,14],[59,0,60,0],[59,3,59,14],[3,2,3,8],[37,0,37,14],[4,2,4,12],[5,0,5,8],[19,0,20,0],[19,1,20,1],[10,1,11,1],[6,0,6,8]]}
["Comparative Winch Handle Loads"]
["Power Ratio = 2 * length of handle * gear ratio / diameter of drum.  \nThis formula is the theoretical maximum and is subject to friction losses."]
["Length of Handle (in.) =",10]
["Max Handle Load (lb.) =",30,"  (Brion Toss recommends 35# as desired max handle load)"]
["Friction Losses (in %)",0.2,"  (Some estimates are as high as 35%, depends on # of wraps, load, and internal construction of the winch)"]
["Loads less than Max Handle Load (I.e. allowable loads) are indicated by bold numbers in following pages, e.g:",null,null,null,null,null,null,null,null,75]
["Greyed out boxes are outside the normal wind range of the subject sail, e.g. ……………………………………….",null,null,null,null,null,null,null,null,114]
[]
["FIRST WINCH SPEED"]
[]
["Sail","Model","1st Speed","Anderson Winch Handle Load (lbs.) for Apparent Wind (Knots)"]
[null,null,"Power Ratio",5,{"$f":"D12+5","v":10},15,20,25,30,35,40,45,50,55,60]
[{"$f":"'Vessel Sheet Loads'!$A$4","v":"Furling Genoa"},{"$f":"'Select Winches'!$B$8","v":"52ST"},{"$f":"VLOOKUP(B13,AndersonSpecs,4)*2*LenHandle/VLOOKUP(B13,AndersonSpecs,10)","v":16.256},{"$f":"(1-FrictionLosses)*'Vessel Sheet Loads'!$C$4/$C13","v":2.5431545275590555},{"$f":"ROUND((1-FrictionLosses)*'Vessel Sheet Loads'!$D$4/$C13,0)","v":10},{"$f":"ROUND((1-FrictionLosses)*'Vessel Sheet Loads'!$E$4/$C13,0)","v":23},{"$f":"ROUND((1-FrictionLosses)*'Vessel Sheet Loads'!$F$4/$C13,0)","v":41},{"$f":"ROUND((1-FrictionLosses)*'Vessel Sheet Loads'!$G$4/$C13,0)","v":64},{"$f":"ROUND((1-FrictionLosses)*'Vessel Sheet Loads'!$H$4/$C13,0)","v":92},{"$f":"ROUND((1-FrictionLosses)*'Vessel Sheet Loads'!$I$4/$C13,0)","v":125},{"$f":"ROUND((1-FrictionLosses)*'Vessel Sheet Loads'!$J$4/$C13,0)","v":163},{"$f":"ROUND((1-FrictionLosses)*'Vessel Sheet Loads'!$K$4/$C13,0)","v":206},{"$f":"ROUND((1-FrictionLosses)*'Vessel Sheet Loads'!$L$4/$C13,0)","v":254},{"$f":"ROUND((1-FrictionLosses)*'Vessel Sheet Loads'!$M$4/$C13,0)","v":308},{"$f":"ROUND((1-FrictionLosses)*'Vessel Sheet Loads'!$N$4/$C13,0)","v":366}]
[{"$f":"'Vessel Sheet Loads'!$A$5","v":"Genoa Part Furled (100%)"},{"$f":"'Select Winches'!$B$8","v":"52ST"},16.256,{"$f":"(1-FrictionLosses)*'Vessel Sheet Loads'!$C$5/$C14","v":2.0415231299212597},{"$f":"ROUND((1-FrictionLosses)*'Vessel Sheet Loads'!$D$5/$C14,0)","v":8},{"$f":"ROUND((1-FrictionLosses)*'Vessel Sheet Loads'!$E$5/$C14,0)","v":18},{"$f":"ROUND((1-FrictionLosses)*'Vessel Sheet Loads'!$F$5/$C14,0)","v":33},{"$f":"ROUND((1-FrictionLosses)*'Vessel Sheet Loads'!$G$5/$C14,0)","v":51},{"$f":"ROUND((1-FrictionLosses)*'Vessel Sheet Loads'!$H$5/$C14,0)","v":73},{"$f":"ROUND((1-FrictionLosses)*'Vessel Sheet Loads'!$I$5/$C14,0)","v":100},{"$f":"ROUND((1-FrictionLosses)*'Vessel Sheet Loads'!$J$5/$C14,0)","v":131},{"$f":"ROUND((1-FrictionLosses)*'Vessel Sheet Loads'!$K$5/$C14,0)","v":165},{"$f":"ROUND((1-FrictionLosses)*'Vessel Sheet Loads'!$L$5/$C14,0)","v":204},{"$f":"ROUND((1-FrictionLosses)*'Vessel Sheet Loads'!$M$5/$C14,0)","v":247},{"$f":"ROUND((1-FrictionLosses)*'Vessel Sheet Loads'!$N$5/$C14,0)","v":294}]
[{"$f":"'Vessel Sheet Loads'!$A$6","v":"Working Staysail"},{"$f":"'Select Winches'!$B$9","v":"40ST"},8.689473684210526,{"$f":"(1-FrictionLosses)*'Vessel Sheet Loads'!$C$6/$C15","v":1.5872077528770443},{"$f":"ROUND((1-FrictionLosses)*'Vessel Sheet Loads'!$D$6/$C15,0)","v":6},{"$f":"ROUND((1-FrictionLosses)*'Vessel Sheet Loads'!$E$6/$C15,0)","v":14},{"$f":"ROUND((1-FrictionLosses)*'Vessel Sheet Loads'!$F$6/$C15,0)","v":25},{"$f":"ROUND((1-FrictionLosses)*'Vessel Sheet Loads'!$G$6/$C15,0)","v":40},{"$f":"ROUND((1-FrictionLosses)*'Vessel Sheet Loads'!$H$6/$C15,0)","v":57},{"$f":"ROUND((1-FrictionLosses)*'Vessel Sheet Loads'!$I$6/$C15,0)","v":78},{"$f":"ROUND((1-FrictionLosses)*'Vessel Sheet Loads'!$J$6/$C15,0)","v":102},{"$f":"ROUND((1-FrictionLosses)*'Vessel Sheet Loads'!$K$6/$C15,0)","v":129},{"$f":"ROUND((1-FrictionLosses)*'Vessel Sheet Loads'!$L$6/$C15,0)","v":159},{"$f":"ROUND((1-FrictionLosses)*'Vessel Sheet Loads'!$M$6/$C15,0)","v":192},{"$f":"ROUND((1-FrictionLosses)*'Vessel Sheet Loads'!$N$6/$C15,0)","v":229}]
{"$rows_left_out":62}
{"sheet":"Price Analysis","index":3,"n_rows":28,"n_cols":7,"rows_kept":28,"cut":false,"hidden":false,"merged":[[3,5,3,6],[4,5,4,6],[2,7,2,8],[3,7,3,8],[4,7,4,8],[0,0,0,6],[20,0,23,0],[2,0,5,0],[11,0,14,0],[14,3,14,7],[23,3,23,7],[5,3,5,7],[2,5,2,6]]}
["COMPARATIVE PRICE ANALYSIS"]
[]
["Anderson","Discount",0.4]
[null,"List Price",{"$f":"SUM(F8:F10)","v":15356}]
[null,"Disc. Price",{"$f":"SUM(G8:G10)","v":9213.5999999999985}]
[null,"Special Price",{"$f":"C5-I6","v":9213.5999999999985}]
["Winch","Quantity","Model","MSRP (each)","Extended Price (each)","Total MSRP","Total Discounted Price"]
["Primary",2,{"$f":"VLOOKUP(A8,'Select Winches'!$A$8:$B$10,2)","v":"52ST"},{"$f":"VLOOKUP(C8,AndersonSpecs,16)","v":3399},{"$f":"(1-$C$3)*D8","v":2039.3999999999999},{"$f":"$B8*D8","v":6798},4078.7999999999997]
["Secondary",4,{"$f":"VLOOKUP(A9,'Select Winches'!$A$8:$B$10,2)","v":"40ST"},{"$f":"VLOOKUP(C9,AndersonSpecs,16)","v":1394},{"$f":"(1-$C$3)*D9","v":836.4},5576,3345.6]
["Trim",3,{"$f":"VLOOKUP(A10,'Select Winches'!$A$8:$B$10,2)","v":"28ST"},{"$f":"VLOOKUP(C10,AndersonSpecs,16)","v":994},{"$f":"(1-$C$3)*D10","v":596.4},2982,1789.1999999999998]
[]
["Harken","Discount",0.4]
[null,"List Price",{"$f":"SUM(F17:F19)","v":16981}]
[null,"Disc. Price",{"$f":"SUM(G17:G19)","v":10188.6}]
[null,"Special Price",{"$f":"C14-I15","v":10188.6}]
{"$rows_left_out":14}
{"sheet":"Harken Winch Specs","index":4,"n_rows":20,"n_cols":16,"rows_kept":20,"cut":false,"hidden":false,"merged":[[0,0,0,15],[1,3,2,5],[1,6,2,8],[1,0,3,0],[1,1,3,1],[1,2,3,2]]}
["Harken Winch Specs"]
["Part No.","SIZE","SPEEDS","Gear Ratio",null,null,"Mfg. Rated Power Ratio",null,null,"Drum","Base","Height","Line","Min.","Max","List"]
[null,null,null,null,null,null,null,null,null,"Dia.(ins)","Dia.(ins)","(ins)","Entry","Line","Line","Price"]
[null,null,null,"1st","2nd","3rd","1st","2nd","3rd",null,null,null,"Hght.(ins)","Dia.(ins)","Dia.(ins)"]
["B16STC",16,1,2.2999999999999998,{"$f":"-NA()","v":{"$error":"#N/A"}},{"$f":"-NA()","v":{"$error":"#N/A"}},16,{"$f":"-NA()","v":{"$error":"#N/A"}},{"$f":"-NA()","v":{"$error":"#N/A"}},2.75,4.75,5.5625,2,0.25,0.5,694]
["B32.2STC",32,2,2.4,4.7,{"$f":"-NA()","v":{"$error":"#N/A"}},16,32,{"$f":"-NA()","v":{"$error":"#N/A"}},2.9375,5.375,6.4375,2.75,0.3125,0.5,1095]
["B40.2STC",40,2,2.2000000000000002,6,{"$f":"-NA()","v":{"$error":"#N/A"}},13.5,40,{"$f":"-NA()","v":{"$error":"#N/A"}},3,5.875,6.9375,2.75,0.3125,0.5,1249]
["B42.2STC",42,2,2.5,7.3,{"$f":"-NA()","v":{"$error":"#N/A"}},14,42,{"$f":"-NA()","v":{"$error":"#N/A"}},3.5625,6.5,7.6875,3.375,0.3125,0.5625,1464.08]
["B44.2STC",44,2,2.5,8.1999999999999993,{"$f":"-NA()","v":{"$error":"#N/A"}},13.8,44,{"$f":"-NA()","v":{"$error":"#N/A"}},3.625,6.6875,8.125,3.375,0.3125,0.5625,1835]
["B46.2STC",46,2,2.5,9.1999999999999993,{"$f":"-NA()","v":{"$error":"#N/A"}},13,46,{"$f":"-NA()","v":{"$error":"#N/A"}},3.9375,6.875,8.5625,3.5625,0.3125,0.5625,2169]
["B48.2STC",48,2,2.5,10,{"$f":"-NA()","v":{"$error":"#N/A"}},12,48,{"$f":"-NA()","v":{"$error":"#N/A"}},4,7.5,9,3.9375,0.3125,0.5625,2729]
["B53.2STC",53,2,3,12,{"$f":"-NA()","v":{"$error":"#N/A"}},13.1,53,{"$f":"-NA()","v":{"$error":"#N/A"}},4.4375,8.6875,9.6875,4.1875,0.3125,0.5625,3150]
["B56.2STC",56,2,5,13,{"$f":"-NA()","v":{"$error":"#N/A"}},21,56,{"$f":"-NA()","v":{"$error":"#N/A"}},4.75,8.875,10.625,4.9375,0.3125,0.625,4100]
["B56.3STC",56,3,5,13,2.2000000000000002,21,56,9,4.75,8.875,10.625,4.9375,0.3125,0.625,4350]
["B64.2STC",64,2,5.7,16.5,{"$f":"-NA()","v":{"$error":"#N/A"}},22.5,64,{"$f":"-NA()","v":{"$error":"#N/A"}},5.125,9.625,12.125,5.875,0.3125,0.75,5660]
{"$rows_left_out":6}
{"sheet":"Anderson Winch Specs","index":5,"n_rows":19,"n_cols":16,"rows_kept":19,"cut":false,"hidden":false,"merged":[[11,3,11,4],[10,0,10,15],[0,0,0,14],[1,1,2,1],[11,1,12,1],[1,2,2,2],[11,2,12,2],[1,3,1,5],[11,6,11,8],[1,6,1,8],[1,0,2,0],[11,0,12,0]]}
["Anderson Self Tailing Winches (Metric)"]
["Part No.","SIZE","SPEEDS","Gear Ratio",null,null,"Mfg. Rated Power Ratio",null,null,"Drum","Base","Height","Line Entry","Line Size","Weight"]
[null,null,null,"1st","2nd","3rd","1st","2nd","3rd",null,null,null,null,null,"kg"]
["12ST",12,1,1.3,{"$f":"-NA()","v":{"$error":"#N/A"}},{"$f":"-NA()","v":{"$error":"#N/A"}},9.5,{"$f":"-NA()","v":{"$error":"#N/A"}},{"$f":"-NA()","v":{"$error":"#N/A"}},"70mm","114mm","130mm","40mm","10-12mm",2.8]
["28ST",28,2,1.3,3.7,{"$f":"-NA()","v":{"$error":"#N/A"}},9.5,26.5,{"$f":"-NA()","v":{"$error":"#N/A"}},"70mm","125mm","152mm","62mm","10-12mm",4.0999999999999996]
["40ST",40,2,1.3,6,{"$f":"-NA()","v":{"$error":"#N/A"}},8.5,39.5,{"$f":"-NA()","v":{"$error":"#N/A"}},"76mm","152mm","172mm","68mm","10-12mm",4.9000000000000004]
["46ST",46,2,2.8,8.4,{"$f":"-NA()","v":{"$error":"#N/A"}},15.5,46.6,{"$f":"-NA()","v":{"$error":"#N/A"}},"90mm","180mm","205mm","85mm","12-14mm",7.3]
["52ST",52,2,3.2,10.5,{"$f":"-NA()","v":{"$error":"#N/A"}},16.2,52,{"$f":"-NA()","v":{"$error":"#N/A"}},"100mm","200mm","225mm","98mm","12-16mm",9.9]
["58ST",58,2,3.7,13.1,{"$f":"-NA()","v":{"$error":"#N/A"}},16.100000000000001,57.7,{"$f":"-NA()","v":{"$error":"#N/A"}},"115mm","230mm","258mm","100mm","14-18mm",15]
[]
["Anderson Self Tailing Winches (English)"]
["Part No.","SIZE","SPEEDS","Gear Ratio",null,null,"Mfg. Rated Power Ratio",null,null,"Drum","Base","Height","Line Entry","Line Size","Weight","List"]
[null,null,null,"1st","2nd","3rd","1st","2nd","3rd",null,null,null,null,null,"lbs","Price"]
["12ST",12,1,1.3,{"$f":"-NA()","v":{"$error":"#N/A"}},{"$f":"-NA()","v":{"$error":"#N/A"}},9.5,{"$f":"-NA()","v":{"$error":"#N/A"}},{"$f":"-NA()","v":{"$error":"#N/A"}},{"$f":"SUBSTITUTE(J4,\"mm\",\"\")/25.4","v":2.7559055118110236},4.4881889763779528,5.1181102362204731,1.5748031496062993,"3/8 - 1/2",{"$f":"O4*2.2","v":6.16},524]
["28ST",28,2,1.3,3.7,{"$f":"-NA()","v":{"$error":"#N/A"}},9.5,26.5,{"$f":"-NA()","v":{"$error":"#N/A"}},2.7559055118110236,4.9212598425196852,5.984251968503937,2.4409448818897639,"3/8 - 1/2",9.02,994]
{"$rows_left_out":5}
{"sheet":"Lewmar Winch Specs","index":6,"n_rows":13,"n_cols":16,"rows_kept":13,"cut":false,"hidden":false,"merged":[[1,13,2,13],[1,9,2,9],[1,10,2,10],[1,11,2,11],[1,1,3,1],[0,0,0,15],[1,0,3,0],[1,3,2,5],[1,6,2,8],[1,2,3,2],[1,14,2,14],[1,12,2,12]]}
["Lewmar Self Tailing Winches"]
["Part No.","SIZE","SPEEDS","Gear Ratio",null,null,"Mfg. Rated Power Ratio",null,null,"Drum","Base","Height","Line Entry","Line Size","Weight","List"]
[null,null,null,null,null,null,null,null,null,null,null,null,null,null,null,"Price"]
[null,null,null,"1st","2nd","3rd","1st","2nd","3rd","in.","in.","in.",null,"in.","lbs"]
["16CST",16,2,2,{"$f":"NA()","v":{"$error":"#N/A"}},{"$f":"NA()","v":{"$error":"#N/A"}},15.8,{"$f":"NA()","v":{"$error":"#N/A"}},{"$f":"NA()","v":{"$error":"#N/A"}},2.5625,4.75,5.75,2.3125,"5/16-1/2",1.9,620]
["30CST",30,2,2,4.2,{"$f":"NA()","v":{"$error":"#N/A"}},13.8,29.2,{"$f":"NA()","v":{"$error":"#N/A"}},2.9375,5.4375,6.3125,2.6875,"5/16-1/2",12.8,999]
["40CST",40,2,1.9,5.8,{"$f":"NA()","v":{"$error":"#N/A"}},13.2,40.200000000000003,{"$f":"NA()","v":{"$error":"#N/A"}},2.9,5.8125,6.8125,3.125,"5/16-1/2",14.7,1130]
["44CST",44,2,2.4,7.6,{"$f":"NA()","v":{"$error":"#N/A"}},13.9,44.8,{"$f":"NA()","v":{"$error":"#N/A"}},3.4375,6.625,7.5625,3.3125,"5/16-9/16",22,1630]
["48CST",48,2,2.6,9,{"$f":"NA()","v":{"$error":"#N/A"}},13.9,48.6,{"$f":"NA()","v":{"$error":"#N/A"}},3.625,7.125,8.1875,3.375,"5/16-9/16",27.7,1744]
["50CST",50,2,2.8,10.5,{"$f":"NA()","v":{"$error":"#N/A"}},13.8,50.6,{"$f":"NA()","v":{"$error":"#N/A"}},4.125,7.875,9.375,4.1875,"5/16-5/8",37.200000000000003,2048]
["54CST",54,2,2.8,11.2,{"$f":"NA()","v":{"$error":"#N/A"}},13.8,54,{"$f":"NA()","v":{"$error":"#N/A"}},4.125,8.0625,9.875,4.5,"5/16-5/8",38.700000000000003,2930]
["58CST",58,2,3.1,13.5,{"$f":"NA()","v":{"$error":"#N/A"}},13.5,58.1,{"$f":"NA()","v":{"$error":"#N/A"}},4.625,9,10.5,4.6875,"5/16-11/16",47.5]
["64CST",64,2,3.1,14.8,{"$f":"NA()","v":{"$error":"#N/A"}},13.4,64,{"$f":"NA()","v":{"$error":"#N/A"}},4.625,9.125,10.6875,4.8125,"5/16-11/16",54.1]